[vbox-dev] error: jni.h: no such file or directory on svn build 31035

Antonio Doldo antonio.doldo at gmail.com
Fri Jul 23 01:44:03 PDT 2010

  Hi all,
from yesterday the last svn don't build for me on debian/ubuntu, anyone 
can confirm this?
I receive an error on missing file 'jni.h':

/home/adoldo/PPA/vbox/src/libs/xpcom18a4/python/src/VariantUtils.cpp: In 
member function ‘PRBool PyXPCOM_InterfaceVariantHelper::Init(PyObject*)’:
warning: format ‘%u’ expects type ‘unsigned int’, but argument 4 has 
type ‘Py_ssize_t’ [-Wformat]
In file included from 
error: jni.h: Nessun file o directory

kmk[2]: *** Waiting for unfinished jobs....
kmk[2]: *** Exiting with status 2
kmk[1]: *** [pass_dlls_this] Error 2
kmk: *** [pass_dlls_order] Error 2
make: *** [debian/build-stamp] Errore 2
dpkg-buildpackage: error: debian/rules build gave error exit status 2

my distro is Ubuntu 10.04 amd64, the path of 'jni.h' is

Thanks for attention,

More information about the vbox-dev mailing list