[vbox-dev] building error svn 31971

Antonio Doldo antonio.doldo at gmail.com
Thu Aug 26 11:15:27 GMT 2010

 Il 26/08/2010 11:12, Frank Mehnert ha scritto:
> Antonio,
> On Thursday 26 August 2010, Antonio Doldo wrote:
>> in the last days I receive an error when building the debian package.
>> This is few minuts ago on svn 31971:
> as always thanks for the report, that problem is fixed in r31974.
> Kind regards,
> Frank
Thanks for immediate response.

Now the building fail on the documentation step.
note that the "texlive-latex-base" package is installed (a previous
error was 'pdflatex' not found)

I/O error : Attempt to load network entity
warning: failed to load external entity
  pdflatex {T}/manual/en_US/UserManual.tex (three passes) ->
This is pdfTeX, Version 3.1415926-1.40.10 (TeX Live 2009/Debian)
 restricted \write18 enabled.
entering extended mode
kmk[2]: ***
Error 1
kmk[1]: *** [pass_others_this] Error 2
kmk: *** [pass_others_order] Error 2
make: *** [debian/build-stamp] Errore 2
dpkg-buildpackage: error: debian/rules build gave error exit status 2

Thanks for your useful work,
best regards,

-------------- next part --------------
An HTML attachment was scrubbed...
URL: <http://www.virtualbox.org/pipermail/vbox-dev/attachments/20100826/c86eb43a/attachment.html>

More information about the vbox-dev mailing list